Reaction Details
TargetRho-associated protein kinase 1
LigandBDBM50358717
Substrate/Competitorn/a
Meas. Tech.ChEMBL_789446 (CHEMBL1924422)
IC50 76±n/a nM
Citation Sessions, EHChowdhury, SYin, YPocas, JRGrant, WSchröter, TLin, LRuiz, CCameron, MDLoGrasso, PBannister, TDFeng, Y Discovery and optimization of indole and 7-azaindoles as Rho kinase (ROCK) inhibitors (part-II). Bioorg Med Chem Lett21:7113-8 (2011) 
 
Rho-associated protein kinase 1
Name:Rho-associated protein kinase 1
Type:Serine/threonine-protein kinase
Mol. Mass.:158156.77
Organism:Homo sapiens (Human)
Description:Q13464
Residue:1354
BDBM50358717
NameBDBM50358717
Synonyms:CHEMBL1922134
TypeSmall organic molecule
Emp. Form.C21H21N5O2
Mol. Mass.375.4237
SMILESCCN(Cc1cccc(OC)c1)C(=O)c1c[nH]c2nc(ccc12)-c1cn[nH]c1