Reaction Details
TargetMetabotropic glutamate receptor 4
LigandBDBM50358788
Substrate/Competitorn/a
Meas. Tech.ChEMBL_790179 (CHEMBL1925519)
IC50 4700±n/a nM
Citation Utley, THaddenham, DSalovich, JMZamorano, RVinson, PNLindsley, CWHopkins, CRNiswender, CM Synthesis and SAR of a novel metabotropic glutamate receptor 4 (mGlu4) antagonist: unexpected 'molecular switch' from a closely related mGlu4 positive allosteric modulator. Bioorg Med Chem Lett21:6955-9 (2011) 
 
Metabotropic glutamate receptor 4
Name:Metabotropic glutamate receptor 4
Type:Protein
Mol. Mass.:101899.95
Organism:Homo sapiens (Human)
Description:Q14833
Residue:912
BDBM50358788
NameBDBM50358788
Synonyms:CHEMBL1922756
TypeSmall organic molecule
Emp. Form.C14H9ClF3NO2
Mol. Mass.315.675
SMILESFC(F)(F)c1ccc(OCC(=O)c2ccc(Cl)nc2)cc1