Reaction Details
TargetCarbonic anhydrase 9
LigandBDBM50358920
Substrate/Competitorn/a
Meas. Tech.ChEMBL_790820 (CHEMBL1926273)
Ki 7±n/a nM
Citation Gitto, RDamiano, FMDe Luca, LFerro, SVullo, DSupuran, CTChimirri, A Synthesis and biological profile of new 1,2,3,4-tetrahydroisoquinolines as selective carbonic anhydrase inhibitors. Bioorg Med Chem19:7003-7 (2011) 
 
Carbonic anhydrase 9
Name:Carbonic anhydrase 9
Type:Enzyme
Mol. Mass.:49669.03
Organism:Homo sapiens (Human)
Description:Catalytic domain of human cloned isozyme was used in the assay
Residue:459
BDBM50358920
NameBDBM50358920
Synonyms:CHEMBL1923677
TypeSmall organic molecule
Emp. Form.C17H17N3O3S
Mol. Mass.343.4
SMILESCOc1ccc2C(N(CCc2c1)S(N)(=O)=O)c1ccc(cc1)C#N