Reaction Details
TargetCarbonic anhydrase 14
LigandBDBM50358925
Substrate/Competitorn/a
Meas. Tech.ChEMBL_790821 (CHEMBL1926274)
Ki 7.1±n/a nM
Citation Gitto, RDamiano, FMDe Luca, LFerro, SVullo, DSupuran, CTChimirri, A Synthesis and biological profile of new 1,2,3,4-tetrahydroisoquinolines as selective carbonic anhydrase inhibitors. Bioorg Med Chem19:7003-7 (2011) 
 
Carbonic anhydrase 14
Name:Carbonic anhydrase 14
Type:Enzyme
Mol. Mass.:37665.67
Organism:Homo sapiens (Human)
Description:Human (cloned) isozyme.
Residue:337
BDBM50358925
NameBDBM50358925
Synonyms:CHEMBL1923682
TypeSmall organic molecule
Emp. Form.C16H19N3O3S
Mol. Mass.333.405
SMILESCOc1ccc2C(N(CCc2c1)S(N)(=O)=O)c1cccc(N)c1