Reaction Details
TargetBeta-secretase 1
LigandBDBM50358933
Substrate/Competitorn/a
Meas. Tech.ChEMBL_790908 (CHEMBL1926456)
Ki 758±n/a nM
Citation Al-Tel, THSemreen, MHAl-Qawasmeh, RASchmidt, MFEl-Awadi, RArdah, MZaarour, RRao, SNEl-Agnaf, O Design, synthesis, and qualitative structure-activity evaluations of novelß-secretase inhibitors as potential Alzheimer's drug leads. J Med Chem54:8373-85 (2011) 
 
Beta-secretase 1
Name:Beta-secretase 1
Type:Protein
Mol. Mass.:55755.10
Organism:Homo sapiens (Human)
Description:P56817
Residue:501
BDBM50358933
NameBDBM50358933
Synonyms:CHEMBL1923702
TypeSmall organic molecule
Emp. Form.C24H23FN4O3S
Mol. Mass.466.528
SMILESC[C@H](NC(=O)c1cc(cc(c1)-c1nc2ccc(F)cc2[nH]1)N(C)S(C)(=O)=O)c1ccccc1