Reaction Details
TargetBeta-secretase 2
LigandBDBM50358934
Substrate/Competitorn/a
Meas. Tech.ChEMBL_790909 (CHEMBL1926457)
Ki 1733±n/a nM
Citation Al-Tel, THSemreen, MHAl-Qawasmeh, RASchmidt, MFEl-Awadi, RArdah, MZaarour, RRao, SNEl-Agnaf, O Design, synthesis, and qualitative structure-activity evaluations of novelß-secretase inhibitors as potential Alzheimer's drug leads. J Med Chem54:8373-85 (2011) 
 
Beta-secretase 2
Name:Beta-secretase 2
Type:Protein
Mol. Mass.:56171.20
Organism:Homo sapiens (Human)
Description:Q9Y5Z0
Residue:518
BDBM50358934
NameBDBM50358934
Synonyms:CHEMBL1923703
TypeSmall organic molecule
Emp. Form.C26H26N4O3S
Mol. Mass.474.575
SMILESC[C@H](NC(=O)c1cc(cc(c1)-c1nc(c[nH]1)-c1ccccc1)N(C)S(C)(=O)=O)c1ccccc1