Reaction Details
TargetBeta-secretase 2
LigandBDBM50358938
Substrate/Competitorn/a
Meas. Tech.ChEMBL_790909 (CHEMBL1926457)
Ki 3617±n/a nM
Citation Al-Tel, THSemreen, MHAl-Qawasmeh, RASchmidt, MFEl-Awadi, RArdah, MZaarour, RRao, SNEl-Agnaf, O Design, synthesis, and qualitative structure-activity evaluations of novelß-secretase inhibitors as potential Alzheimer's drug leads. J Med Chem54:8373-85 (2011) 
 
Beta-secretase 2
Name:Beta-secretase 2
Type:Protein
Mol. Mass.:56171.20
Organism:Homo sapiens (Human)
Description:Q9Y5Z0
Residue:518
BDBM50358938
NameBDBM50358938
Synonyms:CHEMBL1923707
TypeSmall organic molecule
Emp. Form.C24H22FN5
Mol. Mass.399.4634
SMILESCC(C)(C)Nc1c(nc2ccccn12)-c1ccc(cc1)-c1nc2ccc(F)cc2[nH]1