Reaction Details
TargetCannabinoid receptor 2
LigandBDBM50358948
Substrate/Competitorn/a
Meas. Tech.ChEMBL_790915 (CHEMBL1926463)
Ki 790±n/a nM
Citation Brizzi, ACascio, MGFrosini, MLigresti, AAiello, FBiotti, IBrizzi, VPertwee, RGCorelli, FDi Marzo, V Resorcinol-sn-glycerol derivatives: novel 2-arachidonoylglycerol mimetics endowed with high affinity and selectivity for cannabinoid type 1 receptor. J Med Chem54:8278-88 (2011) 
 
Cannabinoid receptor 2
Name:Cannabinoid receptor 2
Type:G Protein-Coupled Receptor (GPCR)
Mol. Mass.:39690.94
Organism:Homo sapiens (Human)
Description:P34972
Residue:360
BDBM50358948
NameBDBM50358948
Synonyms:CHEMBL1923762
TypeSmall organic molecule
Emp. Form.C26H44O6
Mol. Mass.452.624
SMILESCCCCCCC(C)(C)c1cc(O)cc(OCCCCCCCC(=O)OC(CO)CO)c1