Reaction Details
TargetAndrogen receptor
LigandBDBM18862
Substrate/Competitorn/a
Meas. Tech.ChEMBL_791027 (CHEMBL1925688)
IC50 34800±n/a nM
Citation Lack, NAAxerio-Cilies, PTavassoli, PHan, FQChan, KHFeau, CLeBlanc, EGuns, ETGuy, RKRennie, PSCherkasov, A Targeting the binding function 3 (BF3) site of the human androgen receptor through virtual screening. J Med Chem54:8563-73 (2011) 
 
Androgen receptor
Name:Androgen receptor
Type:Receptor
Mol. Mass.:99185.27
Organism:Homo sapiens (Human)
Description:CHO cells were stably transfected with human AR gene.
Residue:920
BDBM18862
NameBDBM18862
Synonyms:2-[4-(4-hydroxy-3-iodophenoxy)-3,5-diiodophenyl]acetic acid TRIAC Triiodothyroacetic acid, 3 | US10322118, Entry Tiratricol
TypeSmall organic molecule
Emp. Form.C14H9I3O4
Mol. Mass.621.9323
SMILESOC(=O)Cc1cc(I)c(Oc2ccc(O)c(I)c2)c(I)c1