Reaction Details
TargetAndrogen receptor
LigandBDBM50359004
Substrate/Competitorn/a
Meas. Tech.ChEMBL_791031 (CHEMBL1925692)
IC50>50000±n/a nM
Citation Lack, NAAxerio-Cilies, PTavassoli, PHan, FQChan, KHFeau, CLeBlanc, EGuns, ETGuy, RKRennie, PSCherkasov, A Targeting the binding function 3 (BF3) site of the human androgen receptor through virtual screening. J Med Chem54:8563-73 (2011) 
 
Androgen receptor
Name:Androgen receptor
Type:Receptor
Mol. Mass.:99185.27
Organism:Homo sapiens (Human)
Description:CHO cells were stably transfected with human AR gene.
Residue:920
BDBM50359004
NameBDBM50359004
Synonyms:CHEMBL1923999
TypeSmall organic molecule
Emp. Form.C14H10Cl2O2S
Mol. Mass.313.199
SMILESOC(=O)c1cccc(CSc2ccc(Cl)cc2Cl)c1