Reaction Details
TargetAndrogen receptor
LigandBDBM50359005
Substrate/Competitorn/a
Meas. Tech.ChEMBL_791031 (CHEMBL1925692)
IC50>50000±n/a nM
Citation Lack, NAAxerio-Cilies, PTavassoli, PHan, FQChan, KHFeau, CLeBlanc, EGuns, ETGuy, RKRennie, PSCherkasov, A Targeting the binding function 3 (BF3) site of the human androgen receptor through virtual screening. J Med Chem54:8563-73 (2011) 
 
Androgen receptor
Name:Androgen receptor
Type:Receptor
Mol. Mass.:99185.27
Organism:Homo sapiens (Human)
Description:CHO cells were stably transfected with human AR gene.
Residue:920
BDBM50359005
NameBDBM50359005
Synonyms:CHEMBL1738937
TypeSmall organic molecule
Emp. Form.C19H20N2O3S
Mol. Mass.356.439
SMILESCc1ccc(OCCn2c(SCCC(O)=O)nc3ccccc23)cc1