Reaction Details
TargetAndrogen receptor
LigandBDBM39612
Substrate/Competitorn/a
Meas. Tech.ChEMBL_791031 (CHEMBL1925692)
IC50>50000±n/a nM
Citation Lack, NAAxerio-Cilies, PTavassoli, PHan, FQChan, KHFeau, CLeBlanc, EGuns, ETGuy, RKRennie, PSCherkasov, A Targeting the binding function 3 (BF3) site of the human androgen receptor through virtual screening. J Med Chem54:8563-73 (2011) 
 
Androgen receptor
Name:Androgen receptor
Type:Receptor
Mol. Mass.:99185.27
Organism:Homo sapiens (Human)
Description:CHO cells were stably transfected with human AR gene.
Residue:920
BDBM39612
NameBDBM39612
Synonyms:2-[2-(3,4-dihydroxyphenyl)-2-oxoethyl]sulfanyl-1H-quinazolin-4-one 2-[[2-(3,4-dihydroxyphenyl)-2-keto-ethyl]thio]-1H-quinazolin-4-one 2-{[2-(3,4-dihydroxyphenyl)-2-oxoethyl]thio}quinazolin-4(3H)-one MLS000089953 cid_706562
TypeSmall organic molecule
Emp. Form.C16H12N2O4S
Mol. Mass.328.342
SMILESOc1ccc(cc1O)C(=O)CSc1nc2ccccc2c(=O)[nH]1