Reaction Details
TargetPotassium voltage-gated channel subfamily H member 2
LigandBDBM50359177
Substrate/Competitorn/a
Meas. Tech.ChEMBL_789985 (CHEMBL1924167)
Ki 9300±n/a nM
Citation Chen, AAspiotis, RCampeau, LCCauchon, EChefson, ADucharme, YFalgueyret, JPGagné, SHan, YHoule, RLaliberté, SLarouche, GLévesque, JFMcKay, DPercival, D Renin inhibitors for the treatment of hypertension: design and optimization of a novel series of spirocyclic piperidines. Bioorg Med Chem Lett21:7399-404 (2011) 
 
Potassium voltage-gated channel subfamily H member 2
Name:Potassium voltage-gated channel subfamily H member 2
Type:Multi-pass membrane protein
Mol. Mass.:126672.65
Organism:Homo sapiens (Human)
Description:Q12809
Residue:1159
BDBM50359177
NameBDBM50359177
Synonyms:CHEMBL1923114
TypeSmall organic molecule
Emp. Form.C23H22Cl2F2N2O2
Mol. Mass.467.336
SMILESFc1cc2CO[C@@]3(CCNC[C@@H]3C(=O)N(Cc3ccc(Cl)cc3Cl)C3CC3)c2cc1F