Reaction Details
TargetPotassium voltage-gated channel subfamily H member 2
LigandBDBM50359188
Substrate/Competitorn/a
Meas. Tech.ChEMBL_789985 (CHEMBL1924167)
Ki 29000±n/a nM
Citation Chen, AAspiotis, RCampeau, LCCauchon, EChefson, ADucharme, YFalgueyret, JPGagné, SHan, YHoule, RLaliberté, SLarouche, GLévesque, JFMcKay, DPercival, D Renin inhibitors for the treatment of hypertension: design and optimization of a novel series of spirocyclic piperidines. Bioorg Med Chem Lett21:7399-404 (2011) 
 
Potassium voltage-gated channel subfamily H member 2
Name:Potassium voltage-gated channel subfamily H member 2
Type:Multi-pass membrane protein
Mol. Mass.:126672.65
Organism:Homo sapiens (Human)
Description:Q12809
Residue:1159
BDBM50359188
NameBDBM50359188
Synonyms:CHEMBL1923125
TypeSmall organic molecule
Emp. Form.C26H25F2N3O2
Mol. Mass.449.4924
SMILESFc1cc2CO[C@@]3(CCNC[C@@H]3C(=O)N(Cc3cccc4cccnc34)C3CC3)c2cc1F