Reaction Details
TargetCytochrome P450 3A4
LigandBDBM50359176
Substrate/Competitorn/a
Meas. Tech.ChEMBL_789986 (CHEMBL1924168)
IC50 5600±n/a nM
Citation Chen, AAspiotis, RCampeau, LCCauchon, EChefson, ADucharme, YFalgueyret, JPGagné, SHan, YHoule, RLaliberté, SLarouche, GLévesque, JFMcKay, DPercival, D Renin inhibitors for the treatment of hypertension: design and optimization of a novel series of spirocyclic piperidines. Bioorg Med Chem Lett21:7399-404 (2011) 
 
Cytochrome P450 3A4
Name:Cytochrome P450 3A4
Type:Enzyme
Mol. Mass.:57349.57
Organism:Homo sapiens (Human)
Description:n/a
Residue:503
BDBM50359176
NameBDBM50359176
Synonyms:CHEMBL1923113
TypeSmall organic molecule
Emp. Form.C23H22Cl2F2N2O2
Mol. Mass.467.336
SMILESFc1cc2CO[C@@]3(CCNC[C@@H]3C(=O)N(Cc3cccc(Cl)c3Cl)C3CC3)c2cc1F