Reaction Details
TargetRenin
LigandBDBM50359182
Substrate/Competitorn/a
Meas. Tech.ChEMBL_789821 (CHEMBL1925082)
pH7.4±n/a
IC50 0.18±n/a nM
Commentsextracted
Citation Chen, AAspiotis, RCampeau, LCCauchon, EChefson, ADucharme, YFalgueyret, JPGagné, SHan, YHoule, RLaliberté, SLarouche, GLévesque, JFMcKay, DPercival, D Renin inhibitors for the treatment of hypertension: design and optimization of a novel series of spirocyclic piperidines. Bioorg Med Chem Lett21:7399-404 (2011) 
 
Renin
Name:Renin
Type:Enzyme
Mol. Mass.:45058.99
Organism:Homo sapiens (Human)
Description:n/a
Residue:406
BDBM50359182
NameBDBM50359182
Synonyms:CHEMBL1923119
TypeSmall organic molecule
Emp. Form.C29H36F2N2O3
Mol. Mass.498.6045
SMILESCOCCCc1cc(C)c(C)c(CN(C2CC2)C(=O)[C@H]2CNCC[C@@]22OCc3cc(F)c(F)cc23)c1