Reaction Details
TargetRenin
LigandBDBM50359184
Substrate/Competitorn/a
Meas. Tech.ChEMBL_789821 (CHEMBL1925082)
pH7.4±n/a
IC50 0.09±n/a nM
Commentsextracted
Citation Chen, AAspiotis, RCampeau, LCCauchon, EChefson, ADucharme, YFalgueyret, JPGagné, SHan, YHoule, RLaliberté, SLarouche, GLévesque, JFMcKay, DPercival, D Renin inhibitors for the treatment of hypertension: design and optimization of a novel series of spirocyclic piperidines. Bioorg Med Chem Lett21:7399-404 (2011) 
 
Renin
Name:Renin
Type:Enzyme
Mol. Mass.:45058.99
Organism:Homo sapiens (Human)
Description:n/a
Residue:406
BDBM50359184
NameBDBM50359184
Synonyms:CHEMBL1923121
TypeSmall organic molecule
Emp. Form.C31H34F2N2O3
Mol. Mass.520.6101
SMILESCOCCCc1cc(CN(C2CC2)C(=O)[C@H]2CNCC[C@@]22OCc3cc(F)c(F)cc23)c2ccccc2c1