Reaction Details
TargetRenin
LigandBDBM50359194
Substrate/Competitorn/a
Meas. Tech.ChEMBL_789821 (CHEMBL1925082)
pH7.4±n/a
IC50 0.05±n/a nM
Commentsextracted
Citation Chen, AAspiotis, RCampeau, LCCauchon, EChefson, ADucharme, YFalgueyret, JPGagné, SHan, YHoule, RLaliberté, SLarouche, GLévesque, JFMcKay, DPercival, D Renin inhibitors for the treatment of hypertension: design and optimization of a novel series of spirocyclic piperidines. Bioorg Med Chem Lett21:7399-404 (2011) 
 
Renin
Name:Renin
Type:Enzyme
Mol. Mass.:45058.99
Organism:Homo sapiens (Human)
Description:n/a
Residue:406
BDBM50359194
NameBDBM50359194
Synonyms:CHEMBL1923131
TypeSmall organic molecule
Emp. Form.C34H44ClF2N3O5S
Mol. Mass.680.245
SMILESCOCCCc1cc(CCCN2CCS(=O)(=O)CC2)c(Cl)c(CN(C2CC2)C(=O)[C@H]2CNCC[C@@]22OCc3cc(F)c(F)cc23)c1