Reaction Details
TargetRenin
LigandBDBM50359170
Substrate/Competitorn/a
Meas. Tech.ChEMBL_789822 (CHEMBL1925083)
IC50 1900±n/a nM
Citation Chen, AAspiotis, RCampeau, LCCauchon, EChefson, ADucharme, YFalgueyret, JPGagné, SHan, YHoule, RLaliberté, SLarouche, GLévesque, JFMcKay, DPercival, D Renin inhibitors for the treatment of hypertension: design and optimization of a novel series of spirocyclic piperidines. Bioorg Med Chem Lett21:7399-404 (2011) 
 
Renin
Name:Renin
Type:Enzyme
Mol. Mass.:45058.99
Organism:Homo sapiens (Human)
Description:n/a
Residue:406
BDBM50359170
NameBDBM50359170
Synonyms:CHEMBL1923107
TypeSmall organic molecule
Emp. Form.C30H38N2O6
Mol. Mass.522.6325
SMILESCOCCCc1cc(CN(C2CC2)C(=O)[C@H]2CNCC[C@@]22OC(=O)c3ccccc23)cc(OCCOC)c1