Reaction Details
TargetRenin
LigandBDBM50359180
Substrate/Competitorn/a
Meas. Tech.ChEMBL_789822 (CHEMBL1925083)
IC50 5.4±n/a nM
Citation Chen, AAspiotis, RCampeau, LCCauchon, EChefson, ADucharme, YFalgueyret, JPGagné, SHan, YHoule, RLaliberté, SLarouche, GLévesque, JFMcKay, DPercival, D Renin inhibitors for the treatment of hypertension: design and optimization of a novel series of spirocyclic piperidines. Bioorg Med Chem Lett21:7399-404 (2011) 
 
Renin
Name:Renin
Type:Enzyme
Mol. Mass.:45058.99
Organism:Homo sapiens (Human)
Description:n/a
Residue:406
BDBM50359180
NameBDBM50359180
Synonyms:CHEMBL1923117
TypeSmall organic molecule
Emp. Form.C25H25F5N2O2
Mol. Mass.480.4702
SMILESCc1c(CN(C2CC2)C(=O)[C@H]2CNCC[C@@]22OCc3cc(F)c(F)cc23)cccc1C(F)(F)F