Reaction Details
TargetRenin
LigandBDBM50359186
Substrate/Competitorn/a
Meas. Tech.ChEMBL_789822 (CHEMBL1925083)
IC50 1.5±n/a nM
Citation Chen, AAspiotis, RCampeau, LCCauchon, EChefson, ADucharme, YFalgueyret, JPGagné, SHan, YHoule, RLaliberté, SLarouche, GLévesque, JFMcKay, DPercival, D Renin inhibitors for the treatment of hypertension: design and optimization of a novel series of spirocyclic piperidines. Bioorg Med Chem Lett21:7399-404 (2011) 
 
Renin
Name:Renin
Type:Enzyme
Mol. Mass.:45058.99
Organism:Homo sapiens (Human)
Description:n/a
Residue:406
BDBM50359186
NameBDBM50359186
Synonyms:CHEMBL1923123
TypeSmall organic molecule
Emp. Form.C26H25F2N3O2
Mol. Mass.449.4924
SMILESFc1cc2CO[C@@]3(CCNC[C@@H]3C(=O)N(Cc3nccc4ccccc34)C3CC3)c2cc1F