Reaction Details
TargetRenin
LigandBDBM50359191
Substrate/Competitorn/a
Meas. Tech.ChEMBL_789822 (CHEMBL1925083)
IC50 0.6±n/a nM
Citation Chen, AAspiotis, RCampeau, LCCauchon, EChefson, ADucharme, YFalgueyret, JPGagné, SHan, YHoule, RLaliberté, SLarouche, GLévesque, JFMcKay, DPercival, D Renin inhibitors for the treatment of hypertension: design and optimization of a novel series of spirocyclic piperidines. Bioorg Med Chem Lett21:7399-404 (2011) 
 
Renin
Name:Renin
Type:Enzyme
Mol. Mass.:45058.99
Organism:Homo sapiens (Human)
Description:n/a
Residue:406
BDBM50359191
NameBDBM50359191
Synonyms:CHEMBL1923128
TypeSmall organic molecule
Emp. Form.C34H46ClF2N3O3
Mol. Mass.618.197
SMILESCCN(CC)CCCc1cc(CCCOC)cc(CN(C2CC2)C(=O)[C@H]2CNCC[C@@]22OCc3cc(F)c(F)cc23)c1Cl