Reaction Details
TargetCarboxylic ester hydrolase
LigandBDBM50359293
Substrate/Competitorn/a
Meas. Tech.ChEMBL_794257 (CHEMBL1932082)
Ki 62000±n/a nM
Citation Zakhari, JSKinoyama, IHixon, MSDi Mola, AGlobisch, DJanda, KD Formulating a new basis for the treatment against botulinum neurotoxin intoxication: 3,4-Diaminopyridine prodrug design and characterization. Bioorg Med Chem19:6203-9 (2011) 
 
Carboxylic ester hydrolase
Name:Carboxylic ester hydrolase
Type:Protein
Mol. Mass.:68842.83
Organism:Equus caballus (Horse)
Description:Q9N1N9
Residue:602
BDBM50359293
NameBDBM50359293
Synonyms:CHEMBL1928397
TypeSmall organic molecule
Emp. Form.C12H17N3O3
Mol. Mass.251.2817
SMILESCC(C)OC(=O)CCC(=O)Nc1ccncc1N