Reaction Details
TargetPotassium voltage-gated channel subfamily H member 2
LigandBDBM50359366
Substrate/Competitorn/a
Meas. Tech.ChEMBL_793127 (CHEMBL1932786)
IC50>500000±n/a nM
Citation Kato, NOka, MMurase, TYoshida, MSakairi, MYamashita, SYasuda, YYoshikawa, AHayashi, YMakino, MTakeda, MMirensha, YKakigami, T Discovery and pharmacological characterization of N-[2-({2-[(2S)-2-cyanopyrrolidin-1-yl]-2-oxoethyl}amino)-2-methylpropyl]-2-methylpyrazolo[1,5-a]pyrimidine-6-carboxamide hydrochloride (anagliptin hydrochloride salt) as a potent and selective DPP-IV inhibitor. Bioorg Med Chem19:7221-7 (2011) 
 
Potassium voltage-gated channel subfamily H member 2
Name:Potassium voltage-gated channel subfamily H member 2
Type:Multi-pass membrane protein
Mol. Mass.:126672.65
Organism:Homo sapiens (Human)
Description:Q12809
Residue:1159
BDBM50359366
NameBDBM50359366
Synonyms:CHEMBL1929387 | CHEMBL1929396
TypeSmall organic molecule
Emp. Form.C19H25N7O2
Mol. Mass.383.4475
SMILESCc1cc2ncc(cn2n1)C(=O)NCC(C)(C)NCC(=O)N1CCC[C@H]1C#N