Reaction Details
TargetCholinesterase
LigandBDBM50359395
Substrate/Competitorn/a
Meas. Tech.ChEMBL_793319 (CHEMBL1931822)
IC50 990±n/a nM
Citation Bolea, IJuárez-Jiménez, Jde Los Ríos, CChioua, MPouplana, RLuque, FJUnzeta, MMarco-Contelles, JSamadi, A Synthesis, biological evaluation, and molecular modeling of donepezil and N-[(5-(benzyloxy)-1-methyl-1H-indol-2-yl)methyl]-N-methylprop-2-yn-1-amine hybrids as new multipotent cholinesterase/monoamine oxidase inhibitors for the treatment of Alzheimer's disease. J Med Chem54:8251-70 (2011) 
 
Cholinesterase
Name:Cholinesterase
Type:Enzyme
Mol. Mass.:65643.35
Organism:Equus caballus (Horse)
Description:P81908
Residue:574
BDBM50359395
NameBDBM50359395
Synonyms:CHEMBL1929422
TypeSmall organic molecule
Emp. Form.C30H39N3O
Mol. Mass.457.6502
SMILESCN(CC#C)Cc1cc2cc(OCCCCC3CCN(Cc4ccccc4)CC3)ccc2n1C