Reaction Details
Target5-hydroxytryptamine receptor 1A
LigandBDBM50359421
Substrate/Competitorn/a
Meas. Tech.ChEMBL_793382 (CHEMBL1931936)
Ki 1.23±n/a nM
Citation Marco, IValhondo, MMartín-Fontecha, MVázquez-Villa, HDel Río, JPlanas, ASagredo, ORamos, JATorrecillas, IRPardo, LFrechilla, DBenhamú, BLópez-Rodríguez, ML New serotonin 5-HT(1A) receptor agonists with neuroprotective effect against ischemic cell damage. J Med Chem54:7986-99 (2011) 
 
5-hydroxytryptamine receptor 1A
Name:5-hydroxytryptamine receptor 1A
Type:G Protein-Coupled Receptor (GPCR)
Mol. Mass.:46445.29
Organism:Rattus norvegicus (rat)
Description:Binding assays were performed using rat hippocampal membranes.
Residue:422
BDBM50359421
NameBDBM50359421
Synonyms:CHEMBL1926735
TypeSmall organic molecule
Emp. Form.C20H27N3O3
Mol. Mass.357.4467
SMILESOc1c2CCCn2c(=O)n1CCCCNC[C@@H]1CCc2ccccc2O1