Reaction Details
TargetNADPH oxidase 1
LigandBDBM50359522
Substrate/Competitorn/a
Meas. Tech.ChEMBL_792877 (CHEMBL1931062)
Ki 173±n/a nM
Citation Gaggini, FLaleu, BOrchard, MFioraso-Cartier, LCagnon, LHoungninou-Molango, SGradia, ADuboux, GMerlot, CHeitz, FSzyndralewiez, CPage, P Design, synthesis and biological activity of original pyrazolo-pyrido-diazepine, -pyrazine and -oxazine dione derivatives as novel dual Nox4/Nox1 inhibitors. Bioorg Med Chem19:6989-99 (2011) 
 
NADPH oxidase 1
Name:NADPH oxidase 1
Type:PROTEIN
Mol. Mass.:64890.44
Organism:Homo sapiens (Human)
Description:ChEMBL_792877
Residue:564
BDBM50359522
NameBDBM50359522
Synonyms:CHEMBL1927160
TypeSmall organic molecule
Emp. Form.C15H12ClN3O3
Mol. Mass.317.727
SMILESClc1ccccc1-n1[nH]c2cc(=O)n3CCOCc3c2c1=O