Reaction Details
TargetCytochrome b-245 heavy chain
LigandBDBM50359527
Substrate/Competitorn/a
Meas. Tech.ChEMBL_792878 (CHEMBL1931063)
Ki 645±n/a nM
Citation Gaggini, FLaleu, BOrchard, MFioraso-Cartier, LCagnon, LHoungninou-Molango, SGradia, ADuboux, GMerlot, CHeitz, FSzyndralewiez, CPage, P Design, synthesis and biological activity of original pyrazolo-pyrido-diazepine, -pyrazine and -oxazine dione derivatives as novel dual Nox4/Nox1 inhibitors. Bioorg Med Chem19:6989-99 (2011) 
 
Cytochrome b-245 heavy chain
Name:Cytochrome b-245 heavy chain
Type:Enzyme
Mol. Mass.:65355.82
Organism:Homo sapiens (Human)
Description:P04839
Residue:570
BDBM50359527
NameBDBM50359527
Synonyms:CHEMBL1927148
TypeSmall organic molecule
Emp. Form.C24H24N4O3
Mol. Mass.416.4724
SMILESCOc1ccccc1-n1[nH]c2cc(=O)n3CCCN(Cc4ccccc4)Cc3c2c1=O