Reaction Details
TargetCytochrome b-245 heavy chain
LigandBDBM50359531
Substrate/Competitorn/a
Meas. Tech.ChEMBL_792878 (CHEMBL1931063)
Ki 1760±n/a nM
Citation Gaggini, FLaleu, BOrchard, MFioraso-Cartier, LCagnon, LHoungninou-Molango, SGradia, ADuboux, GMerlot, CHeitz, FSzyndralewiez, CPage, P Design, synthesis and biological activity of original pyrazolo-pyrido-diazepine, -pyrazine and -oxazine dione derivatives as novel dual Nox4/Nox1 inhibitors. Bioorg Med Chem19:6989-99 (2011) 
 
Cytochrome b-245 heavy chain
Name:Cytochrome b-245 heavy chain
Type:Enzyme
Mol. Mass.:65355.82
Organism:Homo sapiens (Human)
Description:P04839
Residue:570
BDBM50359531
NameBDBM50359531
Synonyms:CHEMBL1927152
TypeSmall organic molecule
Emp. Form.C24H23ClN4O3
Mol. Mass.450.917
SMILESCOc1ccccc1CN1CCCn2c(C1)c1c(cc2=O)[nH]n(-c2ccccc2Cl)c1=O