Reaction Details
TargetNADPH oxidase 4
LigandBDBM50359526
Substrate/Competitorn/a
Meas. Tech.ChEMBL_792879 (CHEMBL1931064)
Ki 142±n/a nM
Citation Gaggini, FLaleu, BOrchard, MFioraso-Cartier, LCagnon, LHoungninou-Molango, SGradia, ADuboux, GMerlot, CHeitz, FSzyndralewiez, CPage, P Design, synthesis and biological activity of original pyrazolo-pyrido-diazepine, -pyrazine and -oxazine dione derivatives as novel dual Nox4/Nox1 inhibitors. Bioorg Med Chem19:6989-99 (2011) 
 
NADPH oxidase 4
Name:NADPH oxidase 4
Type:PROTEIN
Mol. Mass.:66954.54
Organism:Homo sapiens (Human)
Description:ChEMBL_792879
Residue:578
BDBM50359526
NameBDBM50359526
Synonyms:CHEMBL1926690
TypeSmall organic molecule
Emp. Form.C22H19ClN4O2
Mol. Mass.406.865
SMILESClc1ccccc1-n1[nH]c2cc(=O)n3CCN(Cc4ccccc4)Cc3c2c1=O