Reaction Details
TargetNADPH oxidase 4
LigandBDBM50359518
Substrate/Competitorn/a
Meas. Tech.ChEMBL_792879 (CHEMBL1931064)
Ki 94±n/a nM
Citation Gaggini, FLaleu, BOrchard, MFioraso-Cartier, LCagnon, LHoungninou-Molango, SGradia, ADuboux, GMerlot, CHeitz, FSzyndralewiez, CPage, P Design, synthesis and biological activity of original pyrazolo-pyrido-diazepine, -pyrazine and -oxazine dione derivatives as novel dual Nox4/Nox1 inhibitors. Bioorg Med Chem19:6989-99 (2011) 
 
NADPH oxidase 4
Name:NADPH oxidase 4
Type:PROTEIN
Mol. Mass.:66954.54
Organism:Homo sapiens (Human)
Description:ChEMBL_792879
Residue:578
BDBM50359518
NameBDBM50359518
Synonyms:CHEMBL1927156
TypeSmall organic molecule
Emp. Form.C22H20ClN5O2
Mol. Mass.421.88
SMILESClc1ccccc1-n1[nH]c2cc(=O)n3CCCN(Cc4cccnc4)Cc3c2c1=O