Reaction Details
TargetNADPH oxidase 5
LigandBDBM50359531
Substrate/Competitorn/a
Meas. Tech.ChEMBL_792880 (CHEMBL1931065)
Ki 740±n/a nM
Citation Gaggini, FLaleu, BOrchard, MFioraso-Cartier, LCagnon, LHoungninou-Molango, SGradia, ADuboux, GMerlot, CHeitz, FSzyndralewiez, CPage, P Design, synthesis and biological activity of original pyrazolo-pyrido-diazepine, -pyrazine and -oxazine dione derivatives as novel dual Nox4/Nox1 inhibitors. Bioorg Med Chem19:6989-99 (2011) 
 
NADPH oxidase 5
Name:NADPH oxidase 5
Type:PROTEIN
Mol. Mass.:86463.60
Organism:Homo sapiens (Human)
Description:ChEMBL_792880
Residue:765
BDBM50359531
NameBDBM50359531
Synonyms:CHEMBL1927152
TypeSmall organic molecule
Emp. Form.C24H23ClN4O3
Mol. Mass.450.917
SMILESCOc1ccccc1CN1CCCn2c(C1)c1c(cc2=O)[nH]n(-c2ccccc2Cl)c1=O