Reaction Details
TargetPlasma kallikrein
LigandBDBM50359553
Substrate/Competitorn/a
Meas. Tech.ChEMBL_792623 (CHEMBL1930264)
Ki 2000000±n/a nM
Citation Janke, DSommerhoff, CPSchaschke, N The arginine mimickingß-amino acidß³hPhe(3-H2N-CH2) as S1 ligand in cyclotheonamide-basedß-tryptase inhibitors. Bioorg Med Chem19:7236-43 (2011) 
 
Plasma kallikrein
Name:Plasma kallikrein
Type:Protein
Mol. Mass.:71391.16
Organism:Homo sapiens (Human)
Description:P03952
Residue:638
BDBM50359553
NameBDBM50359553
Synonyms:CHEMBL1927450
TypeSmall organic molecule
Emp. Form.C42H60N8O7
Mol. Mass.788.9752
SMILESCC[C@H](C)[C@H]1NC(=O)C[C@H](Cc2cccc(CN)c2)NC(=O)[C@@H]2CCCN2C(=O)[C@H](CNC(=O)\C=C\[C@H](Cc2ccc(O)cc2)NC1=O)NC(=O)CCCCCN