Reaction Details
TargetSigma non-opioid intracellular receptor 1
LigandBDBM50359593
Substrate/Competitorn/a
Meas. Tech.ChEMBL_792760 (CHEMBL1930675)
Ki 14690±n/a nM
Citation Hajipour, ARGuo, LWPal, AMavlyutov, TRuoho, AE Electron-donating para-methoxy converts a benzamide-isoquinoline derivative into a highly Sigma-2 receptor selective ligand. Bioorg Med Chem19:7435-40 (2011) 
 
Sigma non-opioid intracellular receptor 1
Name:Sigma non-opioid intracellular receptor 1
Type:Enzyme Catalytic Domain
Mol. Mass.:25266.54
Organism:RAT
Description:Q9R0C9
Residue:223
BDBM50359593
NameBDBM50359593
Synonyms:CHEMBL1927700
TypeSmall organic molecule
Emp. Form.C22H27N3O5
Mol. Mass.413.4669
SMILESCOc1cc2CCN(CCCCNC(=O)c3ccc(cc3)[N+]([O-])=O)Cc2cc1OC