Reaction Details
Target3-beta-hydroxysteroid-Delta(8),Delta(7)-isomerase
LigandBDBM50419545
Substrate/Competitorn/a
Meas. Tech.ChEMBL_792212 (CHEMBL1930739)
Ki 0.9±n/a nM
Citation Ferorelli, SAbate, CPedone, MPColabufo, NAContino, MPerrone, RBerardi, F Synthesis and binding assays of novel 3,3-dimethylpiperidine derivatives with various lipophilicities ass¿? receptor ligands. Bioorg Med Chem19:7612-22 (2011) 
 
3-beta-hydroxysteroid-Delta(8),Delta(7)-isomerase
Name:3-beta-hydroxysteroid-Delta(8),Delta(7)-isomerase
Type:PROTEIN
Mol. Mass.:26684.52
Organism:Cavia porcellus
Description:ChEMBL_203193
Residue:229
BDBM50419545
NameBDBM50419545
Synonyms:CHEMBL1929278
TypeSmall organic molecule
Emp. Form.C18H25NS
Mol. Mass.287.463
SMILESCC1(C)CCCN(CCCc2cccc3sccc23)C1