Reaction Details
TargetSigma non-opioid intracellular receptor 1
LigandBDBM50419550
Substrate/Competitorn/a
Meas. Tech.ChEMBL_792210 (CHEMBL1930737)
Ki 1.02±n/a nM
Citation Ferorelli, SAbate, CPedone, MPColabufo, NAContino, MPerrone, RBerardi, F Synthesis and binding assays of novel 3,3-dimethylpiperidine derivatives with various lipophilicities ass¿? receptor ligands. Bioorg Med Chem19:7612-22 (2011) 
 
Sigma non-opioid intracellular receptor 1
Name:Sigma non-opioid intracellular receptor 1
Type:Protein
Mol. Mass.:25307.17
Organism:Cavia porcellus (Guinea pig)
Description:Q60492
Residue:223
BDBM50419550
NameBDBM50419550
Synonyms:CHEMBL1929287
TypeSmall organic molecule
Emp. Form.C17H33N
Mol. Mass.251.4506
SMILESCC1(C)CCCN(CCCCC2CCCCC2)C1