Reaction Details
TargetSigma non-opioid intracellular receptor 1
LigandBDBM50419549
Substrate/Competitorn/a
Meas. Tech.ChEMBL_792210 (CHEMBL1930737)
Ki 0.14±n/a nM
Citation Ferorelli, SAbate, CPedone, MPColabufo, NAContino, MPerrone, RBerardi, F Synthesis and binding assays of novel 3,3-dimethylpiperidine derivatives with various lipophilicities ass¿? receptor ligands. Bioorg Med Chem19:7612-22 (2011) 
 
Sigma non-opioid intracellular receptor 1
Name:Sigma non-opioid intracellular receptor 1
Type:Protein
Mol. Mass.:25307.17
Organism:Cavia porcellus (Guinea pig)
Description:Q60492
Residue:223
BDBM50419549
NameBDBM50419549
Synonyms:CHEMBL1929282
TypeSmall organic molecule
Emp. Form.C22H35N
Mol. Mass.313.52
SMILESCC1(C)CCCN(CCCCC2CCCCc3ccccc23)C1