Reaction Details
TargetD(3) dopamine receptor
LigandBDBM50359745
Substrate/Competitorn/a
Meas. Tech.ChEMBL_791615 (CHEMBL1930839)
Ki 0.23±n/a nM
Citation Huber, DLöber, SHübner, HGmeiner, P Bivalent molecular probes for dopamine D2-like receptors. Bioorg Med Chem20:455-66 (2011) 
 
D(3) dopamine receptor
Name:D(3) dopamine receptor
Type:n/a
Mol. Mass.:44243.43
Organism:Homo sapiens (Human)
Description:n/a
Residue:400
BDBM50359745
NameBDBM50359745
Synonyms:CHEMBL1928128
TypeSmall organic molecule
Emp. Form.C56H80N6O10
Mol. Mass.997.2686
SMILESCOc1ccccc1N1CCN(CCCCNC(=O)c2ccc(COCCOCCOCCOCCOCCOCc3ccc(cc3)C(=O)NCCCCN3CCN(CC3)c3ccccc3OC)cc2)CC1