Reaction Details
TargetCasein kinase II subunit alpha
LigandBDBM50359847
Substrate/Competitorn/a
Meas. Tech.ChEMBL_792096 (CHEMBL1930358)
Ki 860±n/a nM
Citation Janeczko, MOrzeszko, AKazimierczuk, ZSzyszka, RBaier, A CK2a and CK2a' subunits differ in their sensitivity to 4,5,6,7-tetrabromo- and 4,5,6,7-tetraiodo-1H-benzimidazole derivatives. Eur J Med Chem47:345-50 (2012) 
 
Casein kinase II subunit alpha
Name:Casein kinase II subunit alpha
Type:Enzyme
Mol. Mass.:45151.12
Organism:Homo sapiens (Human)
Description:P68400
Residue:391
BDBM50359847
NameBDBM50359847
Synonyms:CHEMBL1928909
TypeSmall organic molecule
Emp. Form.C13H13Br4N3O2
Mol. Mass.562.877
SMILESCN(C)c1nc2c(Br)c(Br)c(Br)c(Br)c2n1CCCC(O)=O