Reaction Details
TargetCasein kinase II subunit alpha
LigandBDBM50156680
Substrate/Competitorn/a
Meas. Tech.ChEMBL_792097 (CHEMBL1930359)
Ki 154±n/a nM
Citation Janeczko, MOrzeszko, AKazimierczuk, ZSzyszka, RBaier, A CK2a and CK2a' subunits differ in their sensitivity to 4,5,6,7-tetrabromo- and 4,5,6,7-tetraiodo-1H-benzimidazole derivatives. Eur J Med Chem47:345-50 (2012) 
 
Casein kinase II subunit alpha
Name:Casein kinase II subunit alpha
Type:Enzyme
Mol. Mass.:45151.12
Organism:Homo sapiens (Human)
Description:P68400
Residue:391
BDBM50156680
NameBDBM50156680
Synonyms:2-(dimethylamino)-1-methyl-4,5,6,7-tetrabromo-1Hbenzimidazole | CHEMBL375230
TypeSmall organic molecule
Emp. Form.C10H9Br4N3
Mol. Mass.490.815
SMILESCN(C)c1nc2c(Br)c(Br)c(Br)c(Br)c2n1C