Reaction Details
TargetCasein kinase II subunit alpha'
LigandBDBM50359840
Substrate/Competitorn/a
Meas. Tech.ChEMBL_792164 (CHEMBL1930611)
Ki 35±n/a nM
Citation Janeczko, MOrzeszko, AKazimierczuk, ZSzyszka, RBaier, A CK2a and CK2a' subunits differ in their sensitivity to 4,5,6,7-tetrabromo- and 4,5,6,7-tetraiodo-1H-benzimidazole derivatives. Eur J Med Chem47:345-50 (2012) 
 
Casein kinase II subunit alpha'
Name:Casein kinase II subunit alpha'
Type:Protein
Mol. Mass.:41223.82
Organism:Homo sapiens (Human)
Description:n/a
Residue:350
BDBM50359840
NameBDBM50359840
Synonyms:CHEMBL1928903
TypeSmall organic molecule
Emp. Form.C10H6Br4N2O2S
Mol. Mass.537.848
SMILESOC(=O)CCSc1nc2c(Br)c(Br)c(Br)c(Br)c2[nH]1