Reaction Details
Target5-hydroxytryptamine receptor 2A
LigandBDBM50359962
Substrate/Competitorn/a
Meas. Tech.ChEMBL_791367 (CHEMBL1930138)
Ki 0.0161±n/a nM
Citation Fiorino, FSeverino, BMagli, EPerissutti, EFrecentese, FEsposito, AIncisivo, GMCiano, AMassarelli, PNencini, CSantagada, VCaliendo, G New potent 5-HT(2A) receptor ligands containing an N'-cyanopicolinamidine nucleus: Synthesis and in vitro pharmacological evaluation. Eur J Med Chem47:520-9 (2012) 
 
5-hydroxytryptamine receptor 2A
Name:5-hydroxytryptamine receptor 2A
Type:G Protein-Coupled Receptor (GPCR)
Mol. Mass.:52852.05
Organism:Rattus norvegicus (rat)
Description:Rat cortex membranes 5-HT2A receptors.
Residue:471
BDBM50359962
NameBDBM50359962
Synonyms:CHEMBL1927096
TypeSmall organic molecule
Emp. Form.C18H22N8
Mol. Mass.350.4209
SMILESN#CNC(=NCCCN1CCN(CC1)c1ncccn1)c1ccccn1