Reaction Details
TargetPhosphatidylinositol 4,5-bisphosphate 3-kinase catalytic subunit gamma isoform
LigandBDBM50360063
Substrate/Competitorn/a
Meas. Tech.ChEMBL_793757 (CHEMBL1932618)
IC50 11±n/a nM
Citation Kendall, JDGiddens, ACTsang, KYFrédérick, RMarshall, ESSingh, RLill, CLLee, WJKolekar, SChao, MMalik, AYu, SChaussade, CBuchanan, CRewcastle, GWBaguley, BCFlanagan, JUJamieson, SMDenny, WAShepherd, PR Novel pyrazolo[1,5-a]pyridines as p110a-selective PI3 kinase inhibitors: Exploring the benzenesulfonohydrazide SAR. Bioorg Med Chem20:58-68 (2011) 
 
Phosphatidylinositol 4,5-bisphosphate 3-kinase catalytic subunit gamma isoform
Name:Phosphatidylinositol 4,5-bisphosphate 3-kinase catalytic subunit gamma isoform
Type:Enzyme Subunit
Mol. Mass.:126470.30
Organism:Homo sapiens (Human)
Description:P48736
Residue:1102
BDBM50360063
NameBDBM50360063
Synonyms:CHEMBL1928561
TypeSmall organic molecule
Emp. Form.C18H16N6O5S
Mol. Mass.428.422
SMILESCc1ccc(cc1S(=O)(=O)N(CCO)\N=C\c1cnn2ccc(cc12)C#N)[N+]([O-])=O