Reaction Details
TargetMu-type opioid receptor
LigandBDBM50294426
Substrate/Competitorn/a
Meas. Tech.ChEMBL_793539 (CHEMBL1932290)
Ki 0.770000±n/a nM
Citation Ida, YNemoto, THirayama, SFujii, HOsa, YImai, MNakamura, TKanemasa, TKato, ANagase, H Synthesis of quinolinomorphinan-4-ol derivatives asd opioid receptor agonists. Bioorg Med Chem20:949-61 (2012) 
 
Mu-type opioid receptor
Name:Mu-type opioid receptor
Type:G Protein-Coupled Receptor (GPCR)
Mol. Mass.:44503.11
Organism:Rattus norvegicus (rat)
Description:Competition binding assays were carried out using membrane preparations from transfected HN9.10 cells that constitutively expressed the mu opioid receptor.
Residue:398
BDBM50294426
NameBDBM50294426
Synonyms:CHEMBL559518 | SN-11
TypeSmall organic molecule
Emp. Form.C27H28N2O
Mol. Mass.396.524
SMILESOc1ccc2C[C@@H]3[C@@H]4Cc5cc6ccccc6nc5C[C@]4(CCN3CC3CC3)c2c1