Reaction Details
TargetDelta-type opioid receptor
LigandBDBM50290872
Substrate/Competitorn/a
Meas. Tech.ChEMBL_793540 (CHEMBL1932291)
Ki 1.4±n/a nM
Citation Ida, YNemoto, THirayama, SFujii, HOsa, YImai, MNakamura, TKanemasa, TKato, ANagase, H Synthesis of quinolinomorphinan-4-ol derivatives asd opioid receptor agonists. Bioorg Med Chem20:949-61 (2012) 
 
Delta-type opioid receptor
Name:Delta-type opioid receptor
Type:G Protein-Coupled Receptor (GPCR)
Mol. Mass.:40465.04
Organism:Rattus norvegicus (rat)
Description:Competition binding assays were using CHO-K1 cell membranes expressing the opioid receptor.
Residue:372
BDBM50290872
NameBDBM50290872
Synonyms:(-)-rel-3-((4aR,12aS)-2-methyl-1,2,3,4,4a,5,12,12a-octahydropyrido[3,4-b]acridin-4a-yl)phenol CHEMBL327745 TAN-67 | Tan-67 (racemic)
TypeSmall organic molecule
Emp. Form.C23H24N2O
Mol. Mass.344.4495
SMILESCN1CC[C@@]2(Cc3nc4ccccc4cc3C[C@H]2C1)c1cccc(O)c1