Reaction Details
TargetDelta-type opioid receptor
LigandBDBM50360143
Substrate/Competitorn/a
Meas. Tech.ChEMBL_793540 (CHEMBL1932291)
Ki 0.430000±n/a nM
Citation Ida, YNemoto, THirayama, SFujii, HOsa, YImai, MNakamura, TKanemasa, TKato, ANagase, H Synthesis of quinolinomorphinan-4-ol derivatives asd opioid receptor agonists. Bioorg Med Chem20:949-61 (2012) 
 
Delta-type opioid receptor
Name:Delta-type opioid receptor
Type:G Protein-Coupled Receptor (GPCR)
Mol. Mass.:40465.04
Organism:Rattus norvegicus (rat)
Description:Competition binding assays were using CHO-K1 cell membranes expressing the opioid receptor.
Residue:372
BDBM50360143
NameBDBM50360143
Synonyms:CHEMBL1929363
TypeSmall organic molecule
Emp. Form.C27H26N2O2
Mol. Mass.410.5075
SMILESOc1ccc2C[C@@H]3[C@@H]4Cc5cc6ccccc6nc5[C@@H]5Oc1c2[C@]45CCN3CC1CC1