Reaction Details
TargetDelta-type opioid receptor
LigandBDBM50360141
Substrate/Competitorn/a
Meas. Tech.ChEMBL_793540 (CHEMBL1932291)
Ki 1±n/a nM
Citation Ida, YNemoto, THirayama, SFujii, HOsa, YImai, MNakamura, TKanemasa, TKato, ANagase, H Synthesis of quinolinomorphinan-4-ol derivatives asd opioid receptor agonists. Bioorg Med Chem20:949-61 (2012) 
 
Delta-type opioid receptor
Name:Delta-type opioid receptor
Type:G Protein-Coupled Receptor (GPCR)
Mol. Mass.:40465.04
Organism:Rattus norvegicus (rat)
Description:Competition binding assays were using CHO-K1 cell membranes expressing the opioid receptor.
Residue:372
BDBM50360141
NameBDBM50360141
Synonyms:CHEMBL1929364
TypeSmall organic molecule
Emp. Form.C24H24N2O
Mol. Mass.356.4602
SMILESCN1CC[C@]23Cc4nc5ccccc5cc4C[C@H]2[C@H]1Cc1cccc(O)c31