Reaction Details
TargetDelta-type opioid receptor
LigandBDBM50294428
Substrate/Competitorn/a
Meas. Tech.ChEMBL_793543 (CHEMBL1932294)
Ki 0.290000±n/a nM
Citation Ida, YNemoto, THirayama, SFujii, HOsa, YImai, MNakamura, TKanemasa, TKato, ANagase, H Synthesis of quinolinomorphinan-4-ol derivatives asd opioid receptor agonists. Bioorg Med Chem20:949-61 (2012) 
 
Delta-type opioid receptor
Name:Delta-type opioid receptor
Type:Enzyme Catalytic Domain
Mol. Mass.:40577.25
Organism:MOUSE
Description:P32300
Residue:372
BDBM50294428
NameBDBM50294428
Synonyms:CHEMBL552308 | SN-28
TypeSmall organic molecule
Emp. Form.C24H24N2O
Mol. Mass.356.4602
SMILESCN1CC[C@]23Cc4nc5ccccc5cc4C[C@H]2[C@H]1Cc1ccc(O)cc31