Reaction Details
TargetProstaglandin E2 receptor EP4 subtype
LigandBDBM50360152
Substrate/Competitorn/a
Meas. Tech.ChEMBL_793560 (CHEMBL1932311)
Ki 1.5±n/a nM
Citation Kambe, TMaruyama, TNagase, TOgawa, SMinamoto, CSakata, KMaruyama, TNakai, HToda, M Synthesis and evaluation of novel modified¿-lactam prostanoids as EP4 subtype-selective agonists. Bioorg Med Chem20:702-13 (2012) 
 
Prostaglandin E2 receptor EP4 subtype
Name:Prostaglandin E2 receptor EP4 subtype
Type:G-protein coupled receptor
Mol. Mass.:56175.66
Organism:Mus musculus (Mouse)
Description:n/a
Residue:513
BDBM50360152
NameBDBM50360152
Synonyms:CHEMBL1929545
TypeSmall organic molecule
Emp. Form.C21H29NO3S
Mol. Mass.375.525
SMILESO[C@@H](Cc1ccccc1)\C=C\[C@H]1CCC(=S)N1CCCCCCC(O)=O