Reaction Details
TargetProstaglandin E2 receptor EP1 subtype
LigandBDBM50360158
Substrate/Competitorn/a
Meas. Tech.ChEMBL_793557 (CHEMBL1932308)
Ki 2800±n/a nM
Citation Kambe, TMaruyama, TNagase, TOgawa, SMinamoto, CSakata, KMaruyama, TNakai, HToda, M Synthesis and evaluation of novel modified¿-lactam prostanoids as EP4 subtype-selective agonists. Bioorg Med Chem20:702-13 (2012) 
 
Prostaglandin E2 receptor EP1 subtype
Name:Prostaglandin E2 receptor EP1 subtype
Type:G-protein coupled receptor
Mol. Mass.:43000.62
Organism:Mus musculus (Mouse)
Description:n/a
Residue:405
BDBM50360158
NameBDBM50360158
Synonyms:CHEMBL1929551
TypeSmall organic molecule
Emp. Form.C21H29NO3S2
Mol. Mass.407.59
SMILESCc1cccc(C[C@H](O)\C=C\[C@H]2CCC(=S)N2CCSCCCC(O)=O)c1